{"text_format":"1","workbook":"xlsx","n_sheets":15,"sheets":["Participantes","1ª Partida","2ª Partida","3ª Partida","4ª Partida","5ª Partida","Clasificación","Suizo 32","Suizo 16","Suizo 8","Directa 32","Directa 16","Directa 8","Clasificación Final","Hojas Enfrentamientos"],"not_rendered":{"charts":0,"images":43,"macros":1,"external_links":0,"defined_names":56,"comments":0,"pivot_tables":0},"unopened":[],"bounds":{"document_bytes":16777216,"sheet_cells":100000,"rows_first":2000,"rows_last":500,"rows_between":2000,"halvings":0,"cell_chars":16384,"cell_head_chars":4096},"cells_cut":0,"cells_raw":0,"read":"whole","date_system":"1900"}

{"sheet":"Participantes","index":0,"n_rows":69,"n_cols":17,"rows_kept":69,"cut":false,"hidden":false,"merged":[[8,6,8,7],[8,8,8,9],[8,10,8,11],[5,6,6,7],[4,6,4,8],[0,0,0,3],[3,0,3,3],[2,0,2,2],[1,0,1,3],[0,6,0,9],[1,6,2,8],[1,9,2,9],[3,6,3,8]]}
["NOMBRE CAMPEONATO",null,null,null,null,null,"Parámetros",null,null,null,null,null,32,3,null,null,13]
["MODALIDAD",null,null,null,null,null,"Nº de Participantes",null,null,{"$f":"COUNTA($B$6:$B$69)","v":0},null,null,16,4,null,null,12]
[null,null,null,null,null,null,null,null,null,null,null,null,8,5,null,null,11]
["Lista de Equipos Participantes",null,null,null,null,null,"Nº de Clasificados",null,null,32,null,null,null,null,null,null,10]
["N°","Equipo","Club","Número \nSorteo","Aléatoire",null,"Nº Partidas",null,null,5,null,null,null,null,null,null,9]
[1,null,null,null,null,null,"Eliminatorias",null,null,null,null,null,null,null,null,null,8]
{"$rows_left_out":64}
{"sheet":"1ª Partida","index":1,"n_rows":34,"n_cols":10,"rows_kept":34,"cut":false,"hidden":false,"merged":[[29,7,29,9],[1,3,1,4],[13,7,13,9],[0,0,0,4],[18,7,18,9],[24,7,24,9]]}
["1ª Partida",null,null,null,null,null,null,null,null,{"$f":"Clasificación!AR2","v":"Sorteo correcto"}]
["Pista",{"$f":"Participantes!B5&\" 1\"","v":"Equipo 1"},{"$f":"Participantes!B5&\" 2\"","v":"Equipo 2"},"Resultado",null,null,null,1,{"$f":"COUNTA(C3:C34)-COUNTIF(C3:C34,\"descansa\")","v":0}]
[1,null,null,null,null,{"$f":"IF(B3=\"\",0,IF(OR(D3>13,E3>13,D3<0,E3<0,OR(D3=\"\",E3=\"\"),AND(D3=13,E3=13)),-1,0))","v":0}]
[2,null,null,null,null,{"$f":"IF(B4=\"\",0,IF(OR(D4>13,E4>13,D4<0,E4<0,OR(D4=\"\",E4=\"\"),AND(D4=13,E4=13)),-1,0))","v":0}]
[3,null,null,null,null,0]
[4,null,null,null,null,0]
{"$rows_left_out":29}
{"sheet":"2ª Partida","index":2,"n_rows":34,"n_cols":14,"rows_kept":34,"cut":false,"hidden":false,"merged":[[1,3,1,4],[0,0,0,4]]}
["2ª Partida",null,null,null,null,null,null,null,null,{"$f":"Clasificación!AR2","v":"Sorteo correcto"}]
["Pista",{"$f":"Participantes!B5&\" 1\"","v":"Equipo 1"},{"$f":"Participantes!B5&\" 2\"","v":"Equipo 2"},"Resultado",null,null,null,1,{"$f":"COUNTA(C3:C34)-COUNTIF(C3:C34,\"descansa\")","v":0}]
[1,null,null,null,null,{"$f":"IF(B3=\"\",0,IF(OR(D3>13,E3>13,D3<0,E3<0,OR(D3=\"\",E3=\"\"),AND(D3=13,E3=13)),-1,0))","v":0},null,null,null,null,null,{"$f":"COUNTIF($M$3:$N$18,$B3&$A3)+COUNTIF($M$3:$N$18,$C3&$A3)","v":0},{"$f":"IF('1ª Partida'!$B3=\"\",\"\",'1ª Partida'!$B3&'1ª Partida'!$A3)","v":""},{"$f":"IF(OR('1ª Partida'!$C3=\"\",'1ª Partida'!$C3=\"Descansa\"),\"\",'1ª Partida'!$C3&'1ª Partida'!$A3)","v":""}]
[2,null,null,null,null,0,null,null,null,null,null,0,{"$f":"IF('1ª Partida'!$B4=\"\",\"\",'1ª Partida'!$B4&'1ª Partida'!$A4)","v":""},{"$f":"IF(OR('1ª Partida'!$C4=\"\",'1ª Partida'!$C4=\"Descansa\"),\"\",'1ª Partida'!$C4&'1ª Partida'!$A4)","v":""}]
[3,null,null,null,null,0,null,null,null,null,null,0,{"$f":"IF('1ª Partida'!$B5=\"\",\"\",'1ª Partida'!$B5&'1ª Partida'!$A5)","v":""},{"$f":"IF(OR('1ª Partida'!$C5=\"\",'1ª Partida'!$C5=\"Descansa\"),\"\",'1ª Partida'!$C5&'1ª Partida'!$A5)","v":""}]
[4,null,null,null,null,0,null,null,null,null,null,0,{"$f":"IF('1ª Partida'!$B6=\"\",\"\",'1ª Partida'!$B6&'1ª Partida'!$A6)","v":""},{"$f":"IF(OR('1ª Partida'!$C6=\"\",'1ª Partida'!$C6=\"Descansa\"),\"\",'1ª Partida'!$C6&'1ª Partida'!$A6)","v":""}]
{"$rows_left_out":29}
{"sheet":"3ª Partida","index":3,"n_rows":34,"n_cols":17,"rows_kept":34,"cut":false,"hidden":false,"merged":[[1,3,1,4],[0,0,0,4]]}
["3ª Partida",null,null,null,null,null,null,null,null,{"$f":"Clasificación!AR2","v":"Sorteo correcto"}]
["Pista",{"$f":"Participantes!B5&\" 1\"","v":"Equipo 1"},{"$f":"Participantes!B5&\" 2\"","v":"Equipo 2"},"Resultado",null,null,null,1,{"$f":"COUNTA(C3:C34)-COUNTIF(C3:C34,\"descansa\")","v":0}]
[1,null,null,null,null,{"$f":"IF(B3=\"\",0,IF(OR(D3>13,E3>13,D3<0,E3<0,OR(D3=\"\",E3=\"\"),AND(D3=13,E3=13)),-1,0))","v":0},null,null,null,null,null,{"$f":"COUNTIF($M$3:$N$18,B3&A3)+COUNTIF($M$3:$N$18,C3&A3)","v":0},{"$f":"IF('2ª Partida'!$B3=\"\",\"\",'2ª Partida'!$B3&'2ª Partida'!$A3)","v":""},{"$f":"IF(OR('2ª Partida'!$C3=\"\",'2ª Partida'!$C3=\"Descansa\"),\"\",'2ª Partida'!$C3&'2ª Partida'!$A3)","v":""},{"$f":"COUNTIF($P$3:$Q$18,$B3&$A3)+COUNTIF($P$3:$Q$18,$C3&$A3)","v":0},{"$f":"IF('1ª Partida'!$B3=\"\",\"\",'1ª Partida'!$B3&'1ª Partida'!$A3)","v":""},{"$f":"IF(OR('1ª Partida'!$C3=\"\",'1ª Partida'!$C3=\"Descansa\"),\"\",'1ª Partida'!$C3&'1ª Partida'!$A3)","v":""}]
[2,null,null,null,null,0,null,null,null,null,null,0,{"$f":"IF('2ª Partida'!$B4=\"\",\"\",'2ª Partida'!$B4&'2ª Partida'!$A4)","v":""},{"$f":"IF(OR('2ª Partida'!$C4=\"\",'2ª Partida'!$C4=\"Descansa\"),\"\",'2ª Partida'!$C4&'2ª Partida'!$A4)","v":""},0,{"$f":"IF('1ª Partida'!$B4=\"\",\"\",'1ª Partida'!$B4&'1ª Partida'!$A4)","v":""},{"$f":"IF(OR('1ª Partida'!$C4=\"\",'1ª Partida'!$C4=\"Descansa\"),\"\",'1ª Partida'!$C4&'1ª Partida'!$A4)","v":""}]
[3,null,null,null,null,0,null,null,null,null,null,0,{"$f":"IF('2ª Partida'!$B5=\"\",\"\",'2ª Partida'!$B5&'2ª Partida'!$A5)","v":""},{"$f":"IF(OR('2ª Partida'!$C5=\"\",'2ª Partida'!$C5=\"Descansa\"),\"\",'2ª Partida'!$C5&'2ª Partida'!$A5)","v":""},0,{"$f":"IF('1ª Partida'!$B5=\"\",\"\",'1ª Partida'!$B5&'1ª Partida'!$A5)","v":""},{"$f":"IF(OR('1ª Partida'!$C5=\"\",'1ª Partida'!$C5=\"Descansa\"),\"\",'1ª Partida'!$C5&'1ª Partida'!$A5)","v":""}]
[4,null,null,null,null,0,null,null,null,null,null,0,{"$f":"IF('2ª Partida'!$B6=\"\",\"\",'2ª Partida'!$B6&'2ª Partida'!$A6)","v":""},{"$f":"IF(OR('2ª Partida'!$C6=\"\",'2ª Partida'!$C6=\"Descansa\"),\"\",'2ª Partida'!$C6&'2ª Partida'!$A6)","v":""},0,{"$f":"IF('1ª Partida'!$B6=\"\",\"\",'1ª Partida'!$B6&'1ª Partida'!$A6)","v":""},{"$f":"IF(OR('1ª Partida'!$C6=\"\",'1ª Partida'!$C6=\"Descansa\"),\"\",'1ª Partida'!$C6&'1ª Partida'!$A6)","v":""}]
{"$rows_left_out":29}
{"sheet":"4ª Partida","index":4,"n_rows":34,"n_cols":19,"rows_kept":34,"cut":false,"hidden":false,"merged":[[1,3,1,4],[0,0,0,4]]}
["4ª Partida",null,null,null,null,null,null,null,null,{"$f":"Clasificación!AR2","v":"Sorteo correcto"}]
["Pista",{"$f":"Participantes!B5&\" 1\"","v":"Equipo 1"},{"$f":"Participantes!B5&\" 2\"","v":"Equipo 2"},"Resultado",null,null,null,1,{"$f":"COUNTA(C3:C34)-COUNTIF(C3:C34,\"descansa\")","v":0}]
[1,null,null,null,null,{"$f":"IF(B3=\"\",0,IF(OR(D3>13,E3>13,D3<0,E3<0,OR(D3=\"\",E3=\"\"),AND(D3=13,E3=13)),-1,0))","v":0},null,null,null,null,null,{"$f":"COUNTIF($M$3:$N$18,B3&A3)+COUNTIF($M$3:$N$18,C3&A3)","v":0},{"$f":"IF('3ª Partida'!$B3=\"\",\"\",'3ª Partida'!$B3&'3ª Partida'!$A3)","v":""},{"$f":"IF(OR('3ª Partida'!$C3=\"\",'3ª Partida'!$C3=\"Descansa\"),\"\",'3ª Partida'!$C3&'3ª Partida'!$A3)","v":""},{"$f":"COUNTIF($P$3:$S$18,$B3&$A3)+COUNTIF($P$3:$S$18,$C3&$A3)","v":0},{"$f":"IF('1ª Partida'!$B3=\"\",\"\",'1ª Partida'!$B3&'1ª Partida'!$A3)","v":""},{"$f":"IF(OR('1ª Partida'!$C3=\"\",'1ª Partida'!$C3=\"Descansa\"),\"\",'1ª Partida'!$C3&'1ª Partida'!$A3)","v":""},{"$f":"IF('2ª Partida'!$B3=\"\",\"\",'2ª Partida'!$B3&'2ª Partida'!$A3)","v":""},{"$f":"IF(OR('2ª Partida'!$C3=\"\",'2ª Partida'!$C3=\"Descansa\"),\"\",'2ª Partida'!$C3&'2ª Partida'!$A3)","v":""}]
[2,null,null,null,null,0,null,null,null,null,null,0,{"$f":"IF('3ª Partida'!$B4=\"\",\"\",'3ª Partida'!$B4&'3ª Partida'!$A4)","v":""},{"$f":"IF(OR('3ª Partida'!$C4=\"\",'3ª Partida'!$C4=\"Descansa\"),\"\",'3ª Partida'!$C4&'3ª Partida'!$A4)","v":""},0,{"$f":"IF('1ª Partida'!$B4=\"\",\"\",'1ª Partida'!$B4&'1ª Partida'!$A4)","v":""},{"$f":"IF(OR('1ª Partida'!$C4=\"\",'1ª Partida'!$C4=\"Descansa\"),\"\",'1ª Partida'!$C4&'1ª Partida'!$A4)","v":""},{"$f":"IF('2ª Partida'!$B4=\"\",\"\",'2ª Partida'!$B4&'2ª Partida'!$A4)","v":""},{"$f":"IF(OR('2ª Partida'!$C4=\"\",'2ª Partida'!$C4=\"Descansa\"),\"\",'2ª Partida'!$C4&'2ª Partida'!$A4)","v":""}]
[3,null,null,null,null,0,null,null,null,null,null,0,{"$f":"IF('3ª Partida'!$B5=\"\",\"\",'3ª Partida'!$B5&'3ª Partida'!$A5)","v":""},{"$f":"IF(OR('3ª Partida'!$C5=\"\",'3ª Partida'!$C5=\"Descansa\"),\"\",'3ª Partida'!$C5&'3ª Partida'!$A5)","v":""},0,{"$f":"IF('1ª Partida'!$B5=\"\",\"\",'1ª Partida'!$B5&'1ª Partida'!$A5)","v":""},{"$f":"IF(OR('1ª Partida'!$C5=\"\",'1ª Partida'!$C5=\"Descansa\"),\"\",'1ª Partida'!$C5&'1ª Partida'!$A5)","v":""},{"$f":"IF('2ª Partida'!$B5=\"\",\"\",'2ª Partida'!$B5&'2ª Partida'!$A5)","v":""},{"$f":"IF(OR('2ª Partida'!$C5=\"\",'2ª Partida'!$C5=\"Descansa\"),\"\",'2ª Partida'!$C5&'2ª Partida'!$A5)","v":""}]
[4,null,null,null,null,0,null,null,null,null,null,0,{"$f":"IF('3ª Partida'!$B6=\"\",\"\",'3ª Partida'!$B6&'3ª Partida'!$A6)","v":""},{"$f":"IF(OR('3ª Partida'!$C6=\"\",'3ª Partida'!$C6=\"Descansa\"),\"\",'3ª Partida'!$C6&'3ª Partida'!$A6)","v":""},0,{"$f":"IF('1ª Partida'!$B6=\"\",\"\",'1ª Partida'!$B6&'1ª Partida'!$A6)","v":""},{"$f":"IF(OR('1ª Partida'!$C6=\"\",'1ª Partida'!$C6=\"Descansa\"),\"\",'1ª Partida'!$C6&'1ª Partida'!$A6)","v":""},{"$f":"IF('2ª Partida'!$B6=\"\",\"\",'2ª Partida'!$B6&'2ª Partida'!$A6)","v":""},{"$f":"IF(OR('2ª Partida'!$C6=\"\",'2ª Partida'!$C6=\"Descansa\"),\"\",'2ª Partida'!$C6&'2ª Partida'!$A6)","v":""}]
{"$rows_left_out":29}
{"sheet":"5ª Partida","index":5,"n_rows":34,"n_cols":21,"rows_kept":34,"cut":false,"hidden":false,"merged":[[1,3,1,4],[13,7,13,10],[0,0,0,4],[29,7,29,10]]}
["5ª Partida",null,null,null,null,null,null,null,null,{"$f":"Clasificación!AR2","v":"Sorteo correcto"}]
["Pista",{"$f":"Participantes!B5&\" 1\"","v":"Equipo 1"},{"$f":"Participantes!B5&\" 2\"","v":"Equipo 2"},"Resultado",null,null,null,1,{"$f":"COUNTA(C3:C34)-COUNTIF(C3:C34,\"descansa\")","v":0}]
[1,null,null,null,null,{"$f":"IF(B3=\"\",0,IF(OR(D3>13,E3>13,D3<0,E3<0,OR(D3=\"\",E3=\"\"),AND(D3=13,E3=13)),-1,0))","v":0},null,null,null,null,null,{"$f":"COUNTIF($M$3:$N$18,B3&A3)+COUNTIF($M$3:$N$18,C3&A3)","v":0},{"$f":"IF('4ª Partida'!$B3=\"\",\"\",'4ª Partida'!$B3&'4ª Partida'!$A3)","v":""},{"$f":"IF(OR('4ª Partida'!$C3=\"\",'4ª Partida'!$C3=\"Descansa\"),\"\",'4ª Partida'!$C3&'4ª Partida'!$A3)","v":""},{"$f":"COUNTIF($P$3:$U$18,$B3&$A3)+COUNTIF($P$3:$U$18,$C3&$A3)","v":0},{"$f":"IF('1ª Partida'!$B3=\"\",\"\",'1ª Partida'!$B3&'1ª Partida'!$A3)","v":""},{"$f":"IF(OR('1ª Partida'!$C3=\"\",'1ª Partida'!$C3=\"Descansa\"),\"\",'1ª Partida'!$C3&'1ª Partida'!$A3)","v":""},{"$f":"IF('2ª Partida'!$B3=\"\",\"\",'2ª Partida'!$B3&'2ª Partida'!$A3)","v":""},{"$f":"IF(OR('2ª Partida'!$C3=\"\",'2ª Partida'!$C3=\"Descansa\"),\"\",'2ª Partida'!$C3&'2ª Partida'!$A3)","v":""},{"$f":"IF('3ª Partida'!$B3=\"\",\"\",'3ª Partida'!$B3&'3ª Partida'!$A3)","v":""},{"$f":"IF(OR('3ª Partida'!$C3=\"\",'3ª Partida'!$C3=\"Descansa\"),\"\",'3ª Partida'!$C3&'3ª Partida'!$A3)","v":""}]
[2,null,null,null,null,0,null,null,null,null,null,0,{"$f":"IF('4ª Partida'!$B4=\"\",\"\",'4ª Partida'!$B4&'4ª Partida'!$A4)","v":""},{"$f":"IF(OR('4ª Partida'!$C4=\"\",'4ª Partida'!$C4=\"Descansa\"),\"\",'4ª Partida'!$C4&'4ª Partida'!$A4)","v":""},0,{"$f":"IF('1ª Partida'!$B4=\"\",\"\",'1ª Partida'!$B4&'1ª Partida'!$A4)","v":""},{"$f":"IF(OR('1ª Partida'!$C4=\"\",'1ª Partida'!$C4=\"Descansa\"),\"\",'1ª Partida'!$C4&'1ª Partida'!$A4)","v":""},{"$f":"IF('2ª Partida'!$B4=\"\",\"\",'2ª Partida'!$B4&'2ª Partida'!$A4)","v":""},{"$f":"IF(OR('2ª Partida'!$C4=\"\",'2ª Partida'!$C4=\"Descansa\"),\"\",'2ª Partida'!$C4&'2ª Partida'!$A4)","v":""},{"$f":"IF('3ª Partida'!$B4=\"\",\"\",'3ª Partida'!$B4&'3ª Partida'!$A4)","v":""},{"$f":"IF(OR('3ª Partida'!$C4=\"\",'3ª Partida'!$C4=\"Descansa\"),\"\",'3ª Partida'!$C4&'3ª Partida'!$A4)","v":""}]
[3,null,null,null,null,0,null,null,null,null,null,0,{"$f":"IF('4ª Partida'!$B5=\"\",\"\",'4ª Partida'!$B5&'4ª Partida'!$A5)","v":""},{"$f":"IF(OR('4ª Partida'!$C5=\"\",'4ª Partida'!$C5=\"Descansa\"),\"\",'4ª Partida'!$C5&'4ª Partida'!$A5)","v":""},0,{"$f":"IF('1ª Partida'!$B5=\"\",\"\",'1ª Partida'!$B5&'1ª Partida'!$A5)","v":""},{"$f":"IF(OR('1ª Partida'!$C5=\"\",'1ª Partida'!$C5=\"Descansa\"),\"\",'1ª Partida'!$C5&'1ª Partida'!$A5)","v":""},{"$f":"IF('2ª Partida'!$B5=\"\",\"\",'2ª Partida'!$B5&'2ª Partida'!$A5)","v":""},{"$f":"IF(OR('2ª Partida'!$C5=\"\",'2ª Partida'!$C5=\"Descansa\"),\"\",'2ª Partida'!$C5&'2ª Partida'!$A5)","v":""},{"$f":"IF('3ª Partida'!$B5=\"\",\"\",'3ª Partida'!$B5&'3ª Partida'!$A5)","v":""},{"$f":"IF(OR('3ª Partida'!$C5=\"\",'3ª Partida'!$C5=\"Descansa\"),\"\",'3ª Partida'!$C5&'3ª Partida'!$A5)","v":""}]
[4,null,null,null,null,0,null,null,null,null,null,0,{"$f":"IF('4ª Partida'!$B6=\"\",\"\",'4ª Partida'!$B6&'4ª Partida'!$A6)","v":""},{"$f":"IF(OR('4ª Partida'!$C6=\"\",'4ª Partida'!$C6=\"Descansa\"),\"\",'4ª Partida'!$C6&'4ª Partida'!$A6)","v":""},0,{"$f":"IF('1ª Partida'!$B6=\"\",\"\",'1ª Partida'!$B6&'1ª Partida'!$A6)","v":""},{"$f":"IF(OR('1ª Partida'!$C6=\"\",'1ª Partida'!$C6=\"Descansa\"),\"\",'1ª Partida'!$C6&'1ª Partida'!$A6)","v":""},{"$f":"IF('2ª Partida'!$B6=\"\",\"\",'2ª Partida'!$B6&'2ª Partida'!$A6)","v":""},{"$f":"IF(OR('2ª Partida'!$C6=\"\",'2ª Partida'!$C6=\"Descansa\"),\"\",'2ª Partida'!$C6&'2ª Partida'!$A6)","v":""},{"$f":"IF('3ª Partida'!$B6=\"\",\"\",'3ª Partida'!$B6&'3ª Partida'!$A6)","v":""},{"$f":"IF(OR('3ª Partida'!$C6=\"\",'3ª Partida'!$C6=\"Descansa\"),\"\",'3ª Partida'!$C6&'3ª Partida'!$A6)","v":""}]
{"$rows_left_out":29}
{"sheet":"Clasificación","index":6,"n_rows":66,"n_cols":44,"rows_kept":66,"cut":false,"hidden":false,"merged":[[0,0,0,6]]}
[null,null,null,null,null,null,null,null,null,null,null,null,null,null,null,null,null,null,null,null,null,null,null,{"$f":"Participantes!J4","v":32}]
["Puesto",{"$f":"Participantes!B5","v":"Equipo"},{"$f":"Participantes!C5","v":"Club"},"Puntos","Puntos Adversarios","Puntos Adversarios del Adversario","+/-Bolas","Pts","+/-","Adversario","Pts","+/-","Adversario","Pts","+/-","Adversario","Pts","+/-","Adversario","Pts","+/-","Adversario",null,null,null,null,null,null,null,null,null,null,null,null,null,null,null,"T1/T2","T3/T12","T4/T123","T5/T1234",null,null,{"$f":"IF(SUM(AR3:AR34)>0,\"Sorteo incorrecto\",\"Sorteo correcto\")","v":"Sorteo correcto"}]
[1,null,{"$f":"IF(B3=\"\",\"\",VLOOKUP(B3,Participantes!$B$6:$C$69,2,0))","v":""},null,null,null,{"$f":"IF(B3<>\"\",I3+L3+O3+R3+U3,-9999)","v":-9999},null,null,null,null,null,null,null,null,null,null,null,null,null,null,null,{"$f":"IF(OR(J3=\"\",J3=\"Descansa\"),0,VLOOKUP(J3,$B$3:$D$66,3,0))","v":0},{"$f":"IF(OR(M3=\"\",M3=\"Descansa\"),0,VLOOKUP(M3,$B$3:$D$66,3,0))","v":0},{"$f":"IF(OR(P3=\"\",P3=\"Descansa\"),0,VLOOKUP(P3,$B$3:$D$66,3,0))","v":0},{"$f":"IF(OR(S3=\"\",S3=\"Descansa\"),0,VLOOKUP(S3,$B$3:$D$66,3,0))","v":0},{"$f":"IF(OR(V3=\"\",V3=\"Descansa\"),0,VLOOKUP(V3,$B$3:$D$66,3,0))","v":0},{"$f":"SUM(W3:AA3)","v":0},{"$f":"IF(OR(J3=\"\",J3=\"Descansa\"),0,VLOOKUP(J3,$B$3:$G$66,4,0))","v":0},{"$f":"IF(OR(M3=\"\",M3=\"Descansa\"),0,VLOOKUP(M3,$B$3:$G$66,4,0))","v":0},{"$f":"IF(OR(P3=\"\",P3=\"Descansa\"),0,VLOOKUP(P3,$B$3:$G$66,4,0))","v":0},{"$f":"IF(OR(S3=\"\",S3=\"Descansa\"),0,VLOOKUP(S3,$B$3:$G$66,4,0))","v":0},{"$f":"IF(OR(V3=\"\",V3=\"Descansa\"),0,VLOOKUP(V3,$B$3:$G$66,4,0))","v":0},{"$f":"SUM(AC3:AG3)","v":0},null,null,null,{"$f":"IF(AND(J3=M3,J3<>\"\"),1,0)","v":0},{"$f":"IF(P3=\"\",0,IF(TYPE(FIND(P3,CONCATENATE(J3,M3),1))=16,0,1))","v":0},{"$f":"IF(S3=\"\",0,IF(TYPE(FIND(S3,CONCATENATE(J3,M3,P3),1))=16,0,1))","v":0},{"$f":"IF(V3=\"\",0,IF(TYPE(FIND(V3,CONCATENATE(J3,M3,P3,S3),1))=16,0,1))","v":0},null,null,{"$f":"SUM(AL3:AQ3)","v":0}]
[2,null,{"$f":"IF(B4=\"\",\"\",VLOOKUP(B4,Participantes!$B$6:$C$69,2,0))","v":""},null,null,null,-9999,null,null,null,null,null,null,null,null,null,null,null,null,null,null,null,0,0,0,0,0,{"$f":"SUM(W4:AA4)","v":0},0,0,0,0,0,{"$f":"SUM(AC4:AG4)","v":0},null,null,null,{"$f":"IF(AND(J4=M4,J4<>\"\"),1,0)","v":0},{"$f":"IF(P4=\"\",0,IF(TYPE(FIND(P4,CONCATENATE(J4,M4),1))=16,0,1))","v":0},0,0,null,null,{"$f":"SUM(AL4:AQ4)","v":0}]
[3,null,{"$f":"IF(B5=\"\",\"\",VLOOKUP(B5,Participantes!$B$6:$C$69,2,0))","v":""},null,null,null,-9999,null,null,null,null,null,null,null,null,null,null,null,null,null,null,null,0,0,0,0,0,0,0,0,0,0,0,0,null,null,null,0,0,0,0,null,null,{"$f":"SUM(AL5:AQ5)","v":0}]
[4,null,{"$f":"IF(B6=\"\",\"\",VLOOKUP(B6,Participantes!$B$6:$C$69,2,0))","v":""},null,null,null,-9999,null,null,null,null,null,null,null,null,null,null,null,null,null,null,null,0,0,0,0,0,0,0,0,0,0,0,0,null,null,null,0,0,0,0,null,null,0]
{"$rows_left_out":61}
{"sheet":"Suizo 32","index":7,"n_rows":117,"n_cols":10,"rows_kept":117,"cut":false,"hidden":false,"merged":[[114,1,114,2],[115,1,115,2],[116,1,116,2],[108,1,108,2],[109,1,109,2],[110,1,110,2],[112,1,112,3],[113,1,113,2],[100,1,100,2],[101,1,101,2],[102,1,102,2],[104,0,104,6],[105,1,105,2],[105,5,105,6],[94,1,94,2],[95,1,95,2],[96,1,96,2],[98,1,98,3],[99,1,99,2],[87,1,87,2],[88,1,88,2],[90,0,90,6],[91,1,91,2],[91,5,91,6],[81,1,81,2],[82,1,82,2],[84,1,84,3],[85,1,85,2],[86,1,86,2],[74,1,74,2],[76,0,76,6],[77,1,77,2],[77,5,77,6],[80,1,80,2],[68,1,68,2],[70,1,70,3],[71,1,71,2],[72,1,72,2],[73,1,73,2],[62,0,62,6],[63,1,63,2],[63,5,63,6],[66,1,66,2],[67,1,67,2],[60,1,60,2],[46,1,46,2],[48,0,48,6],[49,1,49,2],[49,5,49,6],[52,1,52,2],[53,1,53,2],[54,1,54,2],[56,1,56,3],[57,1,57,2],[58,1,58,2],[59,1,59,2],[45,1,45,2],[31,1,31,2],[32,1,32,2],[34,0,34,6],[35,1,35,2],[35,5,35,6],[38,1,38,2],[39,1,39,2],[40,1,40,2],[42,1,42,3],[43,1,43,2],[44,1,44,2],[30,1,30,2],[15,1,15,2],[16,1,16,2],[17,1,17,2],[18,1,18,2],[20,0,20,6],[21,1,21,2],[21,5,21,6],[24,1,24,2],[25,1,25,2],[26,1,26,2],[28,1,28,3],[29,1,29,2],[14,1,14,3],[0,0,0,6],[1,0,1,6],[2,0,2,6],[4,0,4,6],[5,2,5,5],[6,0,6,6],[7,1,7,2],[7,5,7,6],[10,1,10,2],[11,1,11,2],[12,1,12,2]]}
[]
[{"$f":"Participantes!A1","v":"NOMBRE CAMPEONATO"}]
[{"$f":"Participantes!A2","v":"MODALIDAD"}]
[]
["1/16 de FINAL"]
[]
{"$rows_left_out":112}
{"sheet":"Suizo 16","index":8,"n_rows":61,"n_cols":10,"rows_kept":61,"cut":false,"hidden":false,"merged":[[12,1,12,2],[14,1,14,3],[6,0,6,6],[7,1,7,2],[7,5,7,6],[10,1,10,2],[11,1,11,2],[0,0,0,6],[1,0,1,6],[2,0,2,6],[4,0,4,6],[5,2,5,5],[56,1,56,3],[39,1,39,2],[20,0,20,6],[21,1,21,2],[21,5,21,6],[24,1,24,2],[25,1,25,2],[26,1,26,2],[34,0,34,6],[35,1,35,2],[35,5,35,6],[38,1,38,2],[30,1,30,2],[31,1,31,2],[32,1,32,2],[52,1,52,2],[42,1,42,3],[43,1,43,2],[44,1,44,2],[45,1,45,2],[46,1,46,2],[57,1,57,2],[58,1,58,2],[59,1,59,2],[60,1,60,2],[15,1,15,2],[16,1,16,2],[17,1,17,2],[18,1,18,2],[28,1,28,3],[29,1,29,2],[53,1,53,2],[54,1,54,2],[40,1,40,2],[48,0,48,6],[49,1,49,2],[49,5,49,6]]}
[]
[{"$f":"Participantes!A1","v":"NOMBRE CAMPEONATO"}]
[{"$f":"Participantes!A2","v":"MODALIDAD"}]
[]
["1/8 de FINAL"]
[]
{"$rows_left_out":56}
{"sheet":"Suizo 8","index":9,"n_rows":49,"n_cols":12,"rows_kept":49,"cut":false,"hidden":false,"merged":[[48,1,48,2],[34,0,34,6],[36,1,36,2],[36,5,36,6],[45,0,45,6],[40,0,40,6],[42,1,42,2],[42,5,42,6],[43,1,43,2],[47,1,47,2],[47,5,47,6],[29,1,29,2],[30,1,30,2],[31,1,31,2],[32,1,32,2],[6,0,6,6],[7,1,7,2],[21,1,21,2],[7,5,7,6],[10,1,10,2],[11,1,11,2],[12,1,12,2],[20,0,20,6],[21,5,21,6],[14,1,14,3],[15,1,15,2],[16,1,16,2],[0,0,0,6],[1,0,1,6],[2,0,2,6],[4,0,4,6],[5,2,5,5],[17,1,17,2],[18,1,18,2],[28,1,28,3],[24,1,24,2],[25,1,25,2],[26,1,26,2]]}
[]
[{"$f":"Participantes!A1","v":"NOMBRE CAMPEONATO"}]
[{"$f":"Participantes!A2","v":"MODALIDAD"}]
[]
["1/4 de FINAL"]
[]
{"$rows_left_out":44}
{"sheet":"Directa 32","index":10,"n_rows":59,"n_cols":12,"rows_kept":59,"cut":false,"hidden":false,"merged":[[55,0,55,6],[57,1,57,2],[57,5,57,6],[58,1,58,2],[46,1,46,2],[46,5,46,6],[50,0,50,6],[52,1,52,2],[52,5,52,6],[53,1,53,2],[44,0,44,6],[0,0,0,6],[1,0,1,7],[2,0,2,7],[3,0,3,6],[24,0,24,7],[25,2,25,5],[26,1,26,2],[26,5,26,6],[36,0,36,7],[38,1,38,2],[38,5,38,6],[4,0,4,7],[5,2,5,5],[6,1,6,2],[6,5,6,6]]}
[]
[{"$f":"Participantes!A1","v":"NOMBRE CAMPEONATO"}]
[{"$f":"Participantes!A2","v":"MODALIDAD"}]
[]
["1/16 de FINAL"]
[]
{"$rows_left_out":54}
{"sheet":"Directa 16","index":11,"n_rows":39,"n_cols":12,"rows_kept":39,"cut":false,"hidden":false,"merged":[[5,2,5,5],[0,0,0,6],[1,0,1,7],[2,0,2,7],[3,0,3,6],[4,0,4,7],[24,0,24,6],[26,1,26,2],[26,5,26,6],[30,0,30,6],[32,1,32,2],[32,5,32,6],[6,1,6,2],[6,5,6,6],[16,0,16,7],[18,1,18,2],[18,5,18,6],[35,0,35,6],[37,1,37,2],[37,5,37,6],[38,1,38,2],[33,1,33,2]]}
[]
[{"$f":"Participantes!A1","v":"NOMBRE CAMPEONATO"}]
[{"$f":"Participantes!A2","v":"MODALIDAD"}]
[]
["1/8 de FINAL"]
[]
{"$rows_left_out":34}
{"sheet":"Directa 8","index":12,"n_rows":27,"n_cols":12,"rows_kept":27,"cut":false,"hidden":false,"merged":[[23,0,23,6],[25,1,25,2],[25,5,25,6],[26,1,26,2],[14,1,14,2],[14,5,14,6],[18,0,18,6],[20,1,20,2],[20,5,20,6],[21,1,21,2],[4,0,4,7],[6,1,6,2],[6,5,6,6],[12,0,12,6],[0,0,0,6],[1,0,1,7],[2,0,2,7],[3,0,3,6]]}
[]
[{"$f":"Participantes!A1","v":"NOMBRE CAMPEONATO"}]
[{"$f":"Participantes!A2","v":"MODALIDAD"}]
[]
["1/4 de FINAL"]
[]
{"$rows_left_out":22}
{"sheet":"Clasificación Final","index":13,"n_rows":66,"n_cols":8,"rows_kept":66,"cut":false,"hidden":false,"merged":[[0,0,0,2]]}
["Clasificación Final"]
["Puesto",{"$f":"Participantes!B5","v":"Equipo"},{"$f":"IF(Participantes!C5=\"\",\"\",Participantes!C5)","v":"Club"}]
[1,{"$f":"CONCATENATE(D3,E3,F3,G3,H3)","v":""},{"$f":"IF(B3=\"\",\"\",VLOOKUP(B3,Participantes!$B$6:$C$69,2,0))","v":""},null,{"$f":"'Directa 8'!J7","v":""},{"$f":"'Directa 16'!J7","v":""},{"$f":"'Directa 32'!J7","v":""},{"$f":"'Suizo 8'!J7","v":""}]
[2,{"$f":"CONCATENATE(D4,E4,F4,G4,H4)","v":""},{"$f":"IF(B4=\"\",\"\",VLOOKUP(B4,Participantes!$B$6:$C$69,2,0))","v":""},null,{"$f":"'Directa 8'!J8","v":""},{"$f":"'Directa 16'!J8","v":""},{"$f":"'Directa 32'!J8","v":""},{"$f":"'Suizo 8'!J8","v":""}]
[3,"",{"$f":"IF(B5=\"\",\"\",VLOOKUP(B5,Participantes!$B$6:$C$69,2,0))","v":""},null,{"$f":"'Directa 8'!J9","v":""},{"$f":"'Directa 16'!J9","v":""},{"$f":"'Directa 32'!J9","v":""},{"$f":"'Suizo 8'!J9","v":""}]
[{"$f":"IF(AND('Suizo 8'!F44=\"\",'Suizo 8'!G44=\"\",'Directa 8'!F22=\"\",'Directa 8'!G22=\"\",'Directa 16'!F34=\"\",'Directa 16'!G34=\"\"),\"\",4)","v":""},"",{"$f":"IF(B6=\"\",\"\",VLOOKUP(B6,Participantes!$B$6:$C$69,2,0))","v":""},null,{"$f":"'Directa 8'!J10","v":""},{"$f":"'Directa 16'!J10","v":""},{"$f":"'Directa 32'!J10","v":""},{"$f":"'Suizo 8'!J10","v":""}]
{"$rows_left_out":61}
{"sheet":"Hojas Enfrentamientos","index":14,"n_rows":30,"n_cols":4,"rows_kept":30,"cut":false,"hidden":false,"merged":[[24,0,24,4],[25,0,25,4],[26,0,26,4],[27,3,27,4],[29,1,29,2],[16,0,16,4],[17,0,17,4],[18,0,18,4],[19,3,19,4],[21,1,21,2],[0,0,0,4],[1,0,1,4],[2,0,2,4],[3,3,3,4],[5,1,5,2],[8,0,8,4],[9,0,9,4],[10,0,10,4],[11,3,11,4],[13,1,13,2]]}
[{"$f":"Participantes!A1","v":"NOMBRE CAMPEONATO"}]
[{"$f":"Participantes!A2","v":"MODALIDAD"}]
[]
["Pista",{"$f":"Participantes!B5&\" 1\"","v":"Equipo 1"},{"$f":"Participantes!B5&\" 2\"","v":"Equipo 2"},"Resultado"]
[]
[null,"Firma"]
{"$rows_left_out":24}