{"text_format":"1","workbook":"xlsx","n_sheets":9,"sheets":["Control Impresión","Participantes","Sorteo","Suizo32","Suizo16","KO8","Clasificación","Actas","Manual"],"not_rendered":{"charts":0,"images":5,"macros":1,"external_links":1,"defined_names":44,"comments":0,"pivot_tables":0},"unopened":[],"bounds":{"document_bytes":16777216,"sheet_cells":100000,"rows_first":2000,"rows_last":500,"rows_between":2000,"halvings":0,"cell_chars":16384,"cell_head_chars":4096},"cells_cut":0,"cells_raw":0,"read":"whole","date_system":"1900"}

{"sheet":"Control Impresión","index":0,"n_rows":14,"n_cols":4,"rows_kept":14,"cut":false,"hidden":false,"merged":[[13,1,13,3],[7,1,10,1],[11,1,12,1],[0,1,0,4],[1,1,1,3],[2,1,2,3],[3,1,6,1],[5,4,6,4]]}
[{"$f":"LOWER(CONCATENATE(Participantes!B1,\" \",Participantes!B2))","v":"fase previa mundial masculino"},"Control de Impresión"]
[null,"Cuaderno FF.AA."]
[null,"Sorteo"]
[null,"Sábado Mañana","Primera Partida","Suizo 32"]
[null,null,"Segunda Partida","Suizo 32"]
[null,null,"Tercera Partida","Suizo 32"]
[null,null,"Cuarta Partida","Suizo 32"]
[null,"Sábado Tarde","Quinta Partida","Suizo 32"]
[null,null,"Sexta Partida","Suizo 16"]
[null,null,"Sextima Partida","Suizo 16"]
[null,null,"Octava Partida","Suizo 16"]
[null,"Domingo Mañana","Novena Partida","KO 8"]
[null,null,"Decina Partida","Semifinal y final"]
[null,"Informe"]

{"sheet":"Participantes","index":1,"n_rows":38,"n_cols":7,"rows_kept":38,"cut":false,"hidden":false,"merged":[[0,1,0,3],[1,1,1,3],[3,1,3,3]]}
[null,"FASE PREVIA MUNDIAL"]
[null,"MASCULINO"]
[]
[null,"PARTICIPACIÓN ORDEN ALFABÉTICO"]
[]
[null,"Nº","Deportista","Federación"]
[null,null,null,null,{"$f":"C7&\" (\"&VLOOKUP(D7,Federaciones,2,0)&\")\"","v":{"$error":"#N/A"}},{"$f":"C7","v":0},13]
[null,null,null,null,{"$error":"#N/A"},{"$f":"C8","v":0},12]
[null,null,null,null,{"$error":"#N/A"},0,11]
[null,null,null,null,{"$error":"#N/A"},0,10]
[null,null,null,null,{"$error":"#N/A"},0,9]
[null,null,null,null,{"$error":"#N/A"},0,8]
[null,null,null,null,{"$error":"#N/A"},0,7]
[null,null,null,null,{"$error":"#N/A"},0,6]
[null,null,null,null,{"$error":"#N/A"},0,5]
[null,null,null,null,{"$error":"#N/A"},0,4]
[null,null,null,null,{"$error":"#N/A"},0,3]
[null,null,null,null,{"$error":"#N/A"},0,2]
[null,null,null,null,{"$error":"#N/A"},0,1]
[null,null,null,null,{"$error":"#N/A"},0,0]
[null,null,null,null,{"$error":"#N/A"},0]
[null,null,null,null,{"$error":"#N/A"},0]
[null,null,null,null,{"$error":"#N/A"},0]
[null,null,null,null,{"$error":"#N/A"},0]
[null,null,null,null,{"$error":"#N/A"},0]
[null,null,null,null,{"$error":"#N/A"},0]
[null,null,null,null,{"$error":"#N/A"},0]
[null,null,null,null,{"$error":"#N/A"},0]
[null,null,null,null,{"$error":"#N/A"},0]
[null,null,null,null,{"$error":"#N/A"},0]
{"$rows_left_out":9}
{"sheet":"Sorteo","index":2,"n_rows":48,"n_cols":4,"rows_kept":48,"cut":false,"hidden":false,"merged":[[48,1,48,2],[54,1,54,2],[16,1,16,3],[27,1,27,3],[38,1,38,3],[0,1,0,3],[1,1,1,3],[3,1,3,3],[4,1,4,3],[5,1,5,3]]}
[null,{"$f":"Participantes!B1","v":"FASE PREVIA MUNDIAL"}]
[null,{"$f":"Participantes!B2","v":"MASCULINO"}]
[]
[]
[]
[null,"GRUPO 1"]
[null,"Número",{"$f":"Participantes!$C$6","v":"Deportista"},{"$f":"Participantes!$D$6","v":"Federación"}]
[null,11,{"$f":"IFERROR(VLOOKUP(B8,Equipos,2,0),\"\")","v":""},{"$f":"IFERROR(VLOOKUP(B8,Equipos,3,0),\"\")","v":""}]
[null,12,"",""]
[null,13,"",""]
[null,14,"",""]
[null,15,"",""]
[null,16,"",""]
[null,17,"",""]
[null,18,"",""]
[]
[null,"GRUPO 2"]
[null,"Número",{"$f":"Participantes!$C$6","v":"Deportista"},{"$f":"Participantes!$D$6","v":"Federación"}]
[null,21,{"$f":"IFERROR(VLOOKUP(B19,Equipos,2,0),\"\")","v":""},{"$f":"IFERROR(VLOOKUP(B19,Equipos,3,0),\"\")","v":""}]
[null,22,"",""]
[null,23,"",""]
[null,24,"",""]
[null,25,"",""]
[null,26,"",""]
[null,27,"",""]
[null,28,"",""]
[]
[null,"GRUPO 3"]
[null,"Número",{"$f":"Participantes!$C$6","v":"Deportista"},{"$f":"Participantes!$D$6","v":"Federación"}]
[null,31,{"$f":"IFERROR(VLOOKUP(B30,Equipos,2,0),\"\")","v":""},{"$f":"IFERROR(VLOOKUP(B30,Equipos,3,0),\"\")","v":""}]
{"$rows_left_out":19}
{"sheet":"Suizo32","index":3,"n_rows":152,"n_cols":28,"rows_kept":152,"cut":false,"hidden":false,"merged":[[103,1,103,8],[123,1,123,8],[128,1,128,8],[151,2,151,3],[69,2,69,4],[106,2,106,4],[143,2,143,4],[139,2,139,3],[141,2,141,3],[129,2,129,3],[130,2,130,3],[131,2,131,3],[132,2,132,3],[134,2,134,3],[81,1,81,8],[87,2,87,3],[88,2,88,3],[89,2,89,3],[90,2,90,3],[95,2,95,3],[97,2,97,3],[98,2,98,3],[146,2,146,3],[147,2,147,3],[12,1,12,8],[17,1,17,8],[22,1,22,8],[26,1,26,8],[29,1,29,8],[49,1,49,8],[54,1,54,8],[59,1,59,8],[63,1,63,8],[62,2,62,3],[44,1,44,8],[50,2,50,3],[51,2,51,3],[52,2,52,3],[53,2,53,3],[38,2,38,3],[39,2,39,3],[40,2,40,3],[32,2,32,4],[43,2,43,3],[33,2,33,3],[34,2,34,3],[35,2,35,3],[36,2,36,3],[148,2,148,3],[149,2,149,3],[150,2,150,3],[112,2,112,3],[113,2,113,3],[114,2,114,3],[144,2,144,3],[145,2,145,3],[133,1,133,8],[137,1,137,8],[140,1,140,8],[135,2,135,3],[136,2,136,3],[138,2,138,3],[18,2,18,3],[64,2,64,3],[65,2,65,3],[67,2,67,3],[80,2,80,3],[70,2,70,3],[71,2,71,3],[72,2,72,3],[73,2,73,3],[74,2,74,3],[75,2,75,3],[76,2,76,3],[77,2,77,3],[79,1,79,7],[80,6,80,7],[66,1,66,8],[55,2,55,3],[56,2,56,3],[57,2,57,3],[58,2,58,3],[60,2,60,3],[61,2,61,3],[0,1,0,7],[1,1,1,7],[3,1,3,7],[5,1,5,7],[6,6,6,7],[4,2,4,6],[42,1,42,7],[43,6,43,7],[19,2,19,3],[20,2,20,3],[21,2,21,3],[23,2,23,3],[24,2,24,3],[25,2,25,3],[37,2,37,3],[27,2,27,3],[28,2,28,3],[30,2,30,3],[6,2,6,3],[7,1,7,8],[13,2,13,3],[14,2,14,3],[15,2,15,3],[16,2,16,3],[92,2,92,3],[93,2,93,3],[94,2,94,3],[86,1,86,8],[91,1,91,8],[125,2,125,3],[126,2,126,3],[127,2,127,3],[99,2,99,3],[101,2,101,3],[102,2,102,3],[104,2,104,3],[116,1,116,7],[117,6,117,7],[117,2,117,3],[118,1,118,8],[124,2,124,3],[107,2,107,3],[108,2,108,3],[109,2,109,3],[110,2,110,3],[111,2,111,3],[96,1,96,8],[100,1,100,8]]}
[null,{"$f":"Participantes!B1","v":"FASE PREVIA MUNDIAL"},null,null,null,null,null,null,null,null,null,null,null,null,null,null,null,null,null,null,null,null,null,null,1,2,3,4]
[null,{"$f":"Participantes!B2","v":"MASCULINO"}]
[]
[null,"1/16  de Final"]
[]
[null,"GRUPO 1",null,null,null,null,null,null,null,null,{"$f":"E9","v":""},{"$f":"G9","v":0},{"$f":"H9","v":0},{"$f":"IF(L6=\"\",0,SUM(IF(L6>M6,1,-1)))","v":-1}]
[null,"Pista","Número",null,{"$f":"Participantes!$C$6&\" 1\"","v":"Deportista 1"},{"$f":"Participantes!$C$6&\" 2\"","v":"Deportista 2"},"Resultado",null,"Pase",null,{"$f":"F9","v":""},{"$f":"H9","v":0},{"$f":"G9","v":0},{"$f":"IF(L7=\"\",0,SUM(IF(L7>M7,1,-1)))","v":-1}]
[null,"Primera partida",null,null,null,null,null,null,null,null,{"$f":"E10","v":""},{"$f":"G10","v":0},{"$f":"H10","v":0},-1]
[null,1,11,12,{"$f":"IFERROR(VLOOKUP(C9,Equipos,4,0),\"\")","v":""},{"$f":"IFERROR(VLOOKUP(D9,Equipos,4,0),\"\")","v":""},null,null,"A",null,{"$f":"F10","v":""},{"$f":"H10","v":0},{"$f":"G10","v":0},-1]
[null,2,13,14,"","",null,null,"B",null,{"$f":"E11","v":""},{"$f":"G11","v":0},{"$f":"H11","v":0},-1]
[null,null,15,16,"","",null,null,"C",null,{"$f":"F11","v":""},{"$f":"H11","v":0},{"$f":"G11","v":0},-1]
[null,null,17,18,"","",null,null,"D",null,{"$f":"E12","v":""},{"$f":"G12","v":0},{"$f":"H12","v":0},-1]
[null,"Segunda partida",null,null,null,null,null,null,null,null,{"$f":"F12","v":""},{"$f":"H12","v":0},{"$f":"G12","v":0},-1]
[null,null,"Ganadores A-B",null,{"$f":"IF(OR(G9=\"\",H9=\"\",G9=H9),\"\",IF(G9>H9,E9,F9))","v":""},{"$f":"IF(OR(G10=\"\",H10=\"\",G10=H10),\"\",IF(G10>H10,E10,F10))","v":""},null,null,"E",null,{"$f":"E14","v":""},{"$f":"G14","v":0},{"$f":"H14","v":0},-1]
[null,null,"Ganadores C-D",null,{"$f":"IF(OR(G11=\"\",H11=\"\",G11=H11),\"\",IF(G11>H11,E11,F11))","v":""},{"$f":"IF(OR(G12=\"\",H12=\"\",G12=H12),\"\",IF(G12>H12,E12,F12))","v":""},null,null,"F",null,{"$f":"F14","v":""},{"$f":"H14","v":0},{"$f":"G14","v":0},-1]
[null,null,"Perdedores A-B",null,{"$f":"IF(OR(G9=\"\",H9=\"\",G9=H9),\"\",IF(G9<H9,E9,F9))","v":""},{"$f":"IF(OR(G10=\"\",H10=\"\",G10=H10),\"\",IF(G10<H10,E10,F10))","v":""},null,null,"G",null,{"$f":"E15","v":""},{"$f":"G15","v":0},{"$f":"H15","v":0},-1]
[null,null,"Perdedores C-D",null,{"$f":"IF(OR(G11=\"\",H11=\"\",G11=H11),\"\",IF(G11<H11,E11,F11))","v":""},{"$f":"IF(OR(G12=\"\",H12=\"\",G12=H12),\"\",IF(G12<H12,E12,F12))","v":""},null,null,"H",null,{"$f":"F15","v":""},{"$f":"H15","v":0},{"$f":"G15","v":0},-1]
[null,"Tercera partida",null,null,null,null,null,null,null,null,{"$f":"E16","v":""},{"$f":"G16","v":0},{"$f":"H16","v":0},-1]
[null,null,"Ganadores E-F",null,{"$f":"IF(OR(G14=\"\",H14=\"\",G14=H14),\"\",IF(G14>H14,E14,F14))","v":""},{"$f":"IF(OR(G15=\"\",H15=\"\",G15=H15),\"\",IF(G15>H15,E15,F15))","v":""},null,null,"I",null,{"$f":"F16","v":""},{"$f":"H16","v":0},{"$f":"G16","v":0},-1]
[null,null,"Gan G - Per F",null,{"$f":"IF(OR(G16=\"\",H16=\"\",G16=H16),\"\",IF(G16>H16,E16,F16))","v":""},{"$f":"IF(OR(G15=\"\",H15=\"\",G15=H15),\"\",IF(G15<H15,E15,F15))","v":""},null,null,"J",null,{"$f":"E17","v":""},{"$f":"G17","v":0},{"$f":"H17","v":0},-1]
[null,null,"Gan H - Per E",null,{"$f":"IF(OR(G17=\"\",H17=\"\",G17=H17),\"\",IF(G17>H17,E17,F17))","v":""},{"$f":"IF(OR(G14=\"\",H14=\"\",G14=H14),\"\",IF(G14<H14,E14,F14))","v":""},null,null,"K",null,{"$f":"F17","v":""},{"$f":"H17","v":0},{"$f":"G17","v":0},-1]
[null,null,"Perdedores G-H",null,{"$f":"IF(OR(G16=\"\",H16=\"\",G16=H16),\"\",IF(G16<H16,E16,F16))","v":""},{"$f":"IF(OR(G17=\"\",H17=\"\",G17=H17),\"\",IF(G17<H17,E17,F17))","v":""},null,null,"L",null,{"$f":"E19","v":""},{"$f":"G19","v":0},{"$f":"H19","v":0},-1]
[null,"Cuarta partida",null,null,null,null,null,null,null,null,{"$f":"F19","v":""},{"$f":"H19","v":0},{"$f":"G19","v":0},-1]
[null,null,"Ganadores J-K",null,{"$f":"IF(OR(G20=\"\",H20=\"\",G20=H20),\"\",IF(G20>H20,E20,F20))","v":""},{"$f":"IF(OR(G21=\"\",H21=\"\",G21=H21),\"\",IF(G21>H21,E21,F21))","v":""},null,null,"M",null,{"$f":"E20","v":""},{"$f":"G20","v":0},{"$f":"H20","v":0},-1]
[null,null,"Per I - Gan L",null,{"$f":"IF(OR(G19=\"\",H19=\"\",G19=H19),\"\",IF(G19<H19,E19,F19))","v":""},{"$f":"IF(OR(G22=\"\",H22=\"\",G22=H22),\"\",IF(G22>H22,E22,F22))","v":""},null,null,"N",null,{"$f":"F20","v":""},{"$f":"H20","v":0},{"$f":"G20","v":0},-1]
[null,null,"Perdedores J-K",null,{"$f":"IF(OR(G20=\"\",H20=\"\",G20=H20),\"\",IF(G20<H20,E20,F20))","v":""},{"$f":"IF(OR(G21=\"\",H21=\"\",G21=H21),\"\",IF(G21<H21,E21,F21))","v":""},null,null,"O",null,{"$f":"E21","v":""},{"$f":"G21","v":0},{"$f":"H21","v":0},-1]
[null,"Quinta partida Caso A (Per I pierde con Gan L)",null,null,null,null,null,null,null,null,{"$f":"F21","v":""},{"$f":"H21","v":0},{"$f":"G21","v":0},-1]
[null,null,"Gan N - Per M",null,{"$f":"IF(OR(G25=\"\",H25=\"\",G25=H25),\"\",IF(G25<H25,F25,\"\"))","v":""},{"$f":"IF(OR(G25=\"\",H25=\"\",G24=\"\",H24=\"\",G24=H24,G25=H25),\"\",IF(G25>H25,\"\",IF(G24<H24,E24,F24)))","v":""},null,null,null,null,{"$f":"E22","v":""},{"$f":"G22","v":0},{"$f":"H22","v":0},-1]
[null,null,"Gan O - Per N",null,{"$f":"IF(OR(G25=\"\",H25=\"\",G26=\"\",H26=\"\",G25=H25,G26=H26),\"\",IF(G25>H25,\"\",IF(G26>H26,E26,F26)))","v":""},{"$f":"IF(OR(G25=\"\",H25=\"\",G25=H25),\"\",IF(G25<H25,E25,\"\"))","v":""},null,null,null,null,{"$f":"F22","v":""},{"$f":"H22","v":0},{"$f":"G22","v":0},-1]
[null,"Quinta partida Caso B (Per I Gana a Gan L)",null,null,null,null,null,null,null,null,{"$f":"E24","v":""},{"$f":"G24","v":0},{"$f":"H24","v":0},-1]
{"$rows_left_out":123}
{"sheet":"Suizo16","index":4,"n_rows":60,"n_cols":14,"rows_kept":60,"cut":false,"hidden":false,"merged":[[56,2,56,3],[57,2,57,3],[58,2,58,3],[59,2,59,3],[48,2,48,3],[51,2,51,3],[52,2,52,3],[53,2,53,3],[55,2,55,4],[6,6,6,7],[0,1,0,7],[1,1,1,7],[3,1,3,7],[4,2,4,6],[5,1,5,7],[6,2,6,3],[9,2,9,3],[10,2,10,3],[11,2,11,3],[13,2,13,4],[19,1,19,7],[14,2,14,3],[15,2,15,3],[16,2,16,3],[17,2,17,3],[20,6,20,7],[33,1,33,7],[23,2,23,3],[24,2,24,3],[25,2,25,3],[27,2,27,4],[28,2,28,3],[29,2,29,3],[30,2,30,3],[31,2,31,3],[20,2,20,3],[34,6,34,7],[47,1,47,7],[48,6,48,7],[34,2,34,3],[37,2,37,3],[38,2,38,3],[39,2,39,3],[41,2,41,4],[42,2,42,3],[43,2,43,3],[44,2,44,3],[45,2,45,3]]}
[null,{"$f":"Participantes!B1","v":"FASE PREVIA MUNDIAL"},null,null,null,null,null,null,null,null,1,2,3,4]
[null,{"$f":"Participantes!B2","v":"MASCULINO"}]
[]
[null,"1/8 de Final"]
[]
[null,"GRUPO 1"]
[null,"Pista","Número",null,{"$f":"Participantes!$C$6&\" 1\"","v":"Deportista 1"},{"$f":"Participantes!$C$6&\" 2\"","v":"Deportista 2"},"Resultado"]
[null,null,11,12,{"$f":"IFERROR(VLOOKUP(C8,Suizo32,2,0),\"Sin asignar\")","v":""},{"$f":"IFERROR(VLOOKUP(D8,Suizo32,2,0),\"Sin asignar\")","v":""},null,null,null,{"$f":"VLOOKUP(C8,Suizo32!$W$34:$X$148,2,0)","v":""}]
[null,null,13,14,{"$f":"IFERROR(VLOOKUP(C9,Suizo32,2,0),\"Sin asignar\")","v":""},{"$f":"IFERROR(VLOOKUP(D9,Suizo32,2,0),\"Sin asignar\")","v":""},null,null,null,{"$f":"VLOOKUP(C9,Suizo32!$W$34:$X$148,2,0)","v":""}]
[null,null,"Ganadores",null,{"$f":"IF(OR(G8=\"\",H8=\"\",G8=H8),\"\",IF(G8>H8,E8,F8))","v":""},{"$f":"IF(OR(G9=\"\",H9=\"\",G9=H9),\"\",IF(G9>H9,E9,F9))","v":""}]
[null,null,"Perdedores",null,{"$f":"IF(OR(G8=\"\",H8=\"\",G8=H8),\"\",IF(G8<H8,E8,F8))","v":""},{"$f":"IF(OR(G9=\"\",H9=\"\",G9=H9),\"\",IF(G9<H9,E9,F9))","v":""}]
[null,null,"Repesca",null,{"$f":"IF(OR(G10=\"\",H10=\"\",G10=H10),\"\",IF(G10<H10,E10,F10))","v":""},{"$f":"IF(OR(G11=\"\",H11=\"\",G11=H11),\"\",IF(G11>H11,E11,F11))","v":""}]
[]
[null,null,"Clasificación",null,null,"Ronda","Pase"]
[null,null,"Primero",null,{"$f":"IF(OR(G10=\"\",H10=\"\",G10=H10),\"\",IF(G10>H10,E10,F10))","v":""},"1/4 de Final",1,null,{"$f":"G15","v":1},{"$f":"E15","v":""}]
[null,null,"Segundo",null,{"$f":"IF(OR(G12=\"\",H12=\"\",G12=H12),\"\",IF(G12>H12,E12,F12))","v":""},"1/4 de Final",6,null,{"$f":"G16","v":6},{"$f":"E16","v":""}]
[null,null,"Tercero",null,{"$f":"IF(OR(G12=\"\",H12=\"\",G12=H12),\"\",IF(G12<H12,E12,F12))","v":""},"9º Puesto ex aequo"]
[null,null,"Cuarto",null,{"$f":"IF(OR(G11=\"\",H11=\"\",G11=H11),\"\",IF(G11<H11,E11,F11))","v":""},"13º Puesto ex aequo"]
[]
[null,"GRUPO 2"]
[null,"Pista","Número",null,{"$f":"Participantes!$C$6&\" 1\"","v":"Deportista 1"},{"$f":"Participantes!$C$6&\" 2\"","v":"Deportista 2"},"Resultado"]
[null,null,21,22,{"$f":"IFERROR(VLOOKUP(C22,Suizo32,2,0),\"Sin asignar\")","v":""},{"$f":"IFERROR(VLOOKUP(D22,Suizo32,2,0),\"Sin asignar\")","v":""},null,null,null,{"$f":"VLOOKUP(C22,Suizo32!$W$34:$X$148,2,0)","v":""}]
[null,null,23,24,{"$f":"IFERROR(VLOOKUP(C23,Suizo32,2,0),\"Sin asignar\")","v":""},{"$f":"IFERROR(VLOOKUP(D23,Suizo32,2,0),\"Sin asignar\")","v":""},null,null,null,{"$f":"VLOOKUP(C23,Suizo32!$W$34:$X$148,2,0)","v":""}]
[null,null,"Ganadores",null,{"$f":"IF(OR(G22=\"\",H22=\"\",G22=H22),\"\",IF(G22>H22,E22,F22))","v":""},{"$f":"IF(OR(G23=\"\",H23=\"\",G23=H23),\"\",IF(G23>H23,E23,F23))","v":""}]
[null,null,"Perdedores",null,{"$f":"IF(OR(G22=\"\",H22=\"\",G22=H22),\"\",IF(G22<H22,E22,F22))","v":""},{"$f":"IF(OR(G23=\"\",H23=\"\",G23=H23),\"\",IF(G23<H23,E23,F23))","v":""}]
[null,null,"Repesca",null,{"$f":"IF(OR(G24=\"\",H24=\"\",G24=H24),\"\",IF(G24<H24,E24,F24))","v":""},{"$f":"IF(OR(G25=\"\",H25=\"\",G25=H25),\"\",IF(G25>H25,E25,F25))","v":""}]
[]
[null,null,"Clasificación",null,null,"Ronda","Pase"]
[null,null,"Primero",null,{"$f":"IF(OR(G24=\"\",H24=\"\",G24=H24),\"\",IF(G24>H24,E24,F24))","v":""},"1/4 de Final",3,null,{"$f":"G29","v":3},{"$f":"E29","v":""}]
[null,null,"Segundo",null,{"$f":"IF(OR(G26=\"\",H26=\"\",G26=H26),\"\",IF(G26>H26,E26,F26))","v":""},"1/4 de Final",8,null,{"$f":"G30","v":8},{"$f":"E30","v":""}]
{"$rows_left_out":31}
{"sheet":"KO8","index":5,"n_rows":21,"n_cols":10,"rows_kept":21,"cut":false,"hidden":false,"merged":[[20,2,20,3],[0,1,0,8],[1,1,1,8],[3,1,3,8],[11,1,11,7],[13,6,13,7],[17,1,17,7],[19,6,19,7],[4,2,4,6],[5,6,5,7],[5,2,5,3],[13,2,13,3]]}
[null,{"$f":"Participantes!B1","v":"FASE PREVIA MUNDIAL"}]
[null,{"$f":"Participantes!B2","v":"MASCULINO"}]
[]
[null,"1/4 de Final"]
[]
[null,"Pista","Número",null,{"$f":"Participantes!$C$6&\" 1\"","v":"Deportista 1"},{"$f":"Participantes!$C$6&\" 2\"","v":"Deportista 2"},"Resultado",null,"Pase"]
[null,null,1,2,{"$f":"IFERROR(VLOOKUP(C7,Suizo16,2,0),\"Sin asignar\")","v":""},"",null,null,9,{"$f":"IF(OR(G7=\"\",H7=\"\",G7=H7),\"\",IF((G7>H7),E7,F7))","v":""}]
[null,null,3,4,"","",null,null,10,{"$f":"IF(OR(G8=\"\",H8=\"\",G8=H8),\"\",IF((G8>H8),E8,F8))","v":""}]
[null,null,5,6,"","",null,null,11,""]
[null,null,7,8,"","",null,null,12,{"$f":"IF(OR(G10=\"\",H10=\"\",G10=H10),\"\",IF((G10>H10),E10,F10))","v":""}]
[]
[null,"SEMIFINALES"]
[]
[null,"Pista","Número",null,{"$f":"Participantes!$C$6&\" 1\"","v":"Deportista 1"},{"$f":"Participantes!$C$6&\" 2\"","v":"Deportista 2"},"Resultado"]
[null,null,9,10,{"$f":"IFERROR(VLOOKUP(C15,KO8e,2,0),\"Sin asignar\")","v":""},{"$f":"IFERROR(VLOOKUP(D15,KO8e,2,0),\"Sin asignar\")","v":""}]
[null,null,11,12,{"$f":"IFERROR(VLOOKUP(C16,KO8e,2,0),\"Sin asignar\")","v":""},{"$f":"IFERROR(VLOOKUP(D16,KO8e,2,0),\"Sin asignar\")","v":""}]
[]
[null,"FINAL"]
[]
[null,"Pista",null,null,{"$f":"Participantes!$C$6&\" 1\"","v":"Deportista 1"},{"$f":"Participantes!$C$6&\" 2\"","v":"Deportista 2"},"Resultado"]
[null,null,"Ganadores",null,{"$f":"IF(OR(G15=\"\",H15=\"\",G15=H15),\"\",IF((G15>H15),E15,F15))","v":""},{"$f":"IF(OR(G16=\"\",H16=\"\",G16=H16),\"\",IF((G16>H16),E16,F16))","v":""}]

{"sheet":"Clasificación","index":6,"n_rows":38,"n_cols":5,"rows_kept":38,"cut":false,"hidden":false,"merged":[[0,1,0,4],[1,1,1,4],[3,1,3,4]]}
[null,{"$f":"Participantes!B1","v":"FASE PREVIA MUNDIAL"}]
[null,{"$f":"Participantes!B2","v":"MASCULINO"}]
[]
[null,"CLASIFICACION FINAL"]
[]
[null,"PUESTO",null,{"$f":"Participantes!C6","v":"Deportista"},{"$f":"Participantes!D6","v":"Federación"}]
[null,"CAMPEÓN",{"$f":"IF(OR('KO8'!G21=\"\",'KO8'!H21=\"\"),\"\",IF('KO8'!G21>'KO8'!H21,'KO8'!E21,'KO8'!F21))","v":""},{"$f":"IF(C7=\"\",\"\",VLOOKUP(C7,Equipos2,2,0))","v":""},{"$f":"IF(D7=\"\",\"\",VLOOKUP(D7,Equipos3,2,0))","v":""}]
[null,"SUBCAMPEÓN",{"$f":"IF(OR('KO8'!G21=\"\",'KO8'!H21=\"\"),\"\",IF('KO8'!G21>'KO8'!H21,'KO8'!F21,'KO8'!E21))","v":""},"",""]
[null,"TERCEROS",{"$f":"IF(OR('KO8'!G15=\"\",'KO8'!H15=\"\"),\"\",IF('KO8'!G15>'KO8'!H15,'KO8'!F15,'KO8'!E15))","v":""},"",""]
[null,null,{"$f":"IF(OR('KO8'!G16=\"\",'KO8'!H16=\"\"),\"\",IF('KO8'!G16>'KO8'!H16,'KO8'!F16,'KO8'!E16))","v":""},"",""]
[null,"5º",{"$f":"IF(OR('KO8'!G7=\"\",'KO8'!H7=\"\"),\"\",IF('KO8'!G7>'KO8'!H7,'KO8'!F7,'KO8'!E7))","v":""},"",""]
[null,null,{"$f":"IF(OR('KO8'!G8=\"\",'KO8'!H8=\"\"),\"\",IF('KO8'!G8>'KO8'!H8,'KO8'!F8,'KO8'!E8))","v":""},"",""]
[null,null,{"$f":"IF(OR('KO8'!G9=\"\",'KO8'!H9=\"\"),\"\",IF('KO8'!G9>'KO8'!H9,'KO8'!F9,'KO8'!E9))","v":""},"",""]
[null,null,{"$f":"IF(OR('KO8'!G10=\"\",'KO8'!H10=\"\"),\"\",IF('KO8'!G10>'KO8'!H10,'KO8'!F10,'KO8'!E10))","v":""},"",""]
[null,"9º",{"$f":"Suizo16!E17","v":""},"",""]
[null,null,{"$f":"Suizo16!E31","v":""},"",""]
[null,null,{"$f":"Suizo16!E45","v":""},"",""]
[null,null,{"$f":"Suizo16!E59","v":""},"",""]
[null,"13º",{"$f":"Suizo16!E18","v":""},"",""]
[null,null,{"$f":"Suizo16!E32","v":""},"",""]
[null,null,{"$f":"Suizo16!E46","v":""},"",""]
[null,null,{"$f":"Suizo16!E60","v":""},"",""]
[null,"17º",{"$f":"Suizo32!E38","v":""},"",""]
[null,null,{"$f":"Suizo32!E75","v":""},"",""]
[null,null,{"$f":"Suizo32!E112","v":""},"",""]
[null,null,{"$f":"Suizo32!E149","v":""},"",""]
[null,"21º",{"$f":"Suizo32!E39","v":""},"",""]
[null,null,{"$f":"Suizo32!E76","v":""},"",""]
[null,null,{"$f":"Suizo32!E113","v":""},"",""]
[null,null,{"$f":"Suizo32!E150","v":""},"",""]
{"$rows_left_out":9}
{"sheet":"Actas","index":7,"n_rows":30,"n_cols":4,"rows_kept":30,"cut":false,"hidden":false,"merged":[[17,0,17,4],[0,0,0,4],[1,0,1,4],[3,3,3,4],[5,1,5,2],[8,0,8,4],[9,0,9,4],[11,3,11,4],[13,1,13,2],[16,0,16,4],[2,0,2,2],[2,3,2,4],[10,0,10,2],[10,3,10,4],[29,1,29,2],[19,3,19,4],[21,1,21,2],[24,0,24,4],[25,0,25,4],[18,0,18,2],[18,3,18,4],[26,0,26,2],[26,3,26,4],[27,3,27,4]]}
[{"$f":"Participantes!B1","v":"FASE PREVIA MUNDIAL"}]
[{"$f":"Participantes!B2","v":"MASCULINO"}]
[]
["Pista",{"$f":"Participantes!C6&\" 1\"","v":"Deportista 1"},{"$f":"Participantes!C6&\" 2\"","v":"Deportista 2"},"Resultado"]
[]
[null,"Firma"]
[]
[]
[{"$f":"Participantes!B1","v":"FASE PREVIA MUNDIAL"}]
[{"$f":"Participantes!B2","v":"MASCULINO"}]
[]
["Pista",{"$f":"Participantes!C6&\" 1\"","v":"Deportista 1"},{"$f":"Participantes!C6&\" 2\"","v":"Deportista 2"},"Resultado"]
[]
[null,"Firma"]
[]
[]
[{"$f":"Participantes!B1","v":"FASE PREVIA MUNDIAL"}]
[{"$f":"Participantes!B2","v":"MASCULINO"}]
[]
["Pista",{"$f":"Participantes!C6&\" 1\"","v":"Deportista 1"},{"$f":"Participantes!C6&\" 2\"","v":"Deportista 2"},"Resultado"]
[]
[null,"Firma"]
[]
[]
[{"$f":"Participantes!B1","v":"FASE PREVIA MUNDIAL"}]
[{"$f":"Participantes!B2","v":"MASCULINO"}]
[]
["Pista",{"$f":"Participantes!C6&\" 1\"","v":"Deportista 1"},{"$f":"Participantes!C6&\" 2\"","v":"Deportista 2"},"Resultado"]
[]
[null,"Firma"]
{"$rows_left_out":1}
{"sheet":"Manual","index":8,"n_rows":30,"n_cols":4,"rows_kept":30,"cut":false,"hidden":false,"merged":[[9,1,9,4],[10,2,10,4],[1,2,1,4],[3,1,3,4],[4,1,4,4],[5,1,5,4],[6,1,6,4],[7,1,7,4],[8,1,8,4]]}
[]
[null,null,"MANUAL"]
[]
[null,"1º Rellenar la hoja de \"Participación\" La denominación del Campeonato Categoria y el nombre del deportista y la Federación"]
[null,"2º Para rellenar la hoja del sorteo solo se tiene que poner el numero del sorteo en la hoja de \"Participación\"."]
[null,"3º Los números del sorteo no son del 1 al 32, sino que será un numero compuesto por dos cifras ultima indica la posición en el grupo ejemplo y el resto incica el grupo: numero 42 quiere decir que es el grupo 4 posición 2."]
[null,"4º Los emparejamientos están automatizados solo se tiene que añadir los resultados."]
[null,"5º Para imprimir usar la hoja \"Control de Impresión\""]
[null,"6º Las celdas en las que no se tiene que introducir datos están protegidas, para desproteger no se necesita clave."]
[null,"7º Tabla de las federaciones y siglas"]
[]
[null,null,"Federación","Siglas"]
[null,null,"FEDERACIÓN ANDALUZA","AN"]
[null,null,"FEDERACIÓN ARAGONESA","AR"]
[null,null,"FEDERACIÓN ASTURIANA","AS"]
[null,null,"FEDERACIÓN BALEAR","IB"]
[null,null,"FEDERACIÓN CANARIA","CN"]
[null,null,"FEDERACIÓN CÁNTABRA","CB"]
[null,null,"FEDERACIÓN CASTELLANO-LEONESA","CL"]
[null,null,"FEDERACIÓN CASTELLANO-MANCHEGA","CM"]
[null,null,"FEDERACIÓN CATALANA","CT"]
[null,null,"FEDERACIÓN CEUTÍ","CE"]
[null,null,"FEDERACIÓN EXTREMEÑA","EX"]
[null,null,"FEDERACIÓN GALEGA","GA"]
[null,null,"FEDERACIÓN MADRILEÑA","MD"]
[null,null,"FEDERACIÓN MELILLENSE","ML"]
[null,null,"FEDERACIÓN MURCIANA","MC"]
[null,null,"FEDERACIÓN RIOJANA","RI"]
[null,null,"FEDERACIÓN COMUNIDAD VALENCIANA","VC"]
[null,null,"FEDERACIÓN VASCA","PV"]